{"text_format":"1","workbook":"xlsx","n_sheets":6,"sheets":["راهنما","Data","Report","Stat","Sett","Archive"],"not_rendered":{"charts":0,"images":0,"macros":1,"external_links":2,"defined_names":1,"comments":0,"pivot_tables":0},"unopened":[],"bounds":{"document_bytes":16777216,"sheet_cells":100000,"rows_first":2000,"rows_last":500,"rows_between":2000,"halvings":0,"cell_chars":16384,"cell_head_chars":4096},"cells_cut":0,"cells_raw":0,"read":"whole","date_system":"1900"}

{"sheet":"راهنما","index":0,"n_rows":52,"n_cols":18,"rows_kept":52,"cut":false,"hidden":false,"merged":[[2,1,2,19],[1,1,1,19],[17,1,17,19],[7,1,7,19],[8,1,8,19],[9,1,9,16],[9,17,9,19],[10,1,10,19],[11,1,11,19],[12,1,12,19],[13,1,13,19],[14,1,14,19],[15,1,15,19],[16,1,16,19],[3,1,4,19],[5,17,6,17],[5,18,6,18],[29,1,29,19],[18,1,18,19],[19,1,19,19],[20,1,20,19],[21,1,21,19],[22,1,22,19],[23,1,23,19],[24,1,24,19],[25,1,25,19],[26,1,26,19],[27,1,27,19],[28,1,28,19],[5,19,6,19],[42,1,42,19],[30,1,30,19],[32,1,32,19],[33,1,33,19],[34,1,34,19],[35,1,35,19],[36,1,36,19],[37,1,37,19],[38,1,38,19],[39,1,39,19],[40,1,40,19],[41,1,41,19],[53,2,53,3],[43,1,43,19],[44,1,44,19],[45,1,45,19],[46,1,46,19],[47,1,47,19],[48,1,48,19],[49,1,49,19],[50,1,50,19],[51,1,51,19],[52,1,52,19]]}
[]
[null,"عنوان برنامه"]
[null,"برنامه مدیریت ساختمان و آپارتمان نسخه پیشرفته ، حق شارژ و دریافت و پرداخت ها ، تقسیم هزینه ها بر اساس نفرات یا متراژ ، گزارش واحد و سرجمع ، تا سقف 50 واحد"]
[]
[]
[]
[]
[null,"توضيحات عمومي برنامه های تحت اکسل"]
[null,"* در ابتدا اعلام می کنیم كه از همراه شدن با شما کاربر عزیز گرامی بسيار خرسنديم و اميدواريم بتوانيم همکار خوبي براي تان بوده و در ساير زمینه ها نیز افتخار ميزباني درخواست های شما عزیزان را داشته باشيم."]
[null,"* بسيار خوشحال خواهيم شد اگر نظرات و انتقادات و یا پيشنهادات خود را درباره اين برنامه و همچنين کلیه خدمات ارائه شده توسط این مرکز را از طريق لینک مقابل به ما اعلام بفرمائید.",null,null,null,null,null,null,null,null,null,null,null,null,null,null,null,"برای اعلام نظرتان کلیک کنید"]
{"$rows_left_out":43}
{"sheet":"Data","index":1,"n_rows":80,"n_cols":24,"rows_kept":80,"cut":false,"hidden":false,"merged":[[5,3,5,4]]}
[null,null,null,null,null,null,null,null,null,null,null,null,null,null,null,null,null,null,null,127401]
[null,null,null,null,null,null,null,null,null,null,null,null,null,null,null,null,null,null,null,"نامحدود"]
[]
[]
[]
[null,{"$f":"COUNTA(data5[[#Data],[تاریخ]])+8","v":8},99,{"$f":"IF(C6=Sett!C2,\"برای همه واحدها لحاظ می شود\",IF(COUNTIF(sett[کد],C6)>0,\"مالک فعلی : \"&VLOOKUP(C6,sett[],6,FALSE),\"\"))","v":"برای همه واحدها لحاظ می شود"},null,{"$f":"IF(C6=Sett!C2,\"همه واحدها\",IF(COUNTIF(sett[کد],C6)>0,VLOOKUP(C6,sett[],2,FALSE),\"وجود ندارد\"))","v":"همه واحدها"},{"$f":"J_TODAY(1)","v":"1404/07/09"},"بصورت مساوی","بر اساس متراژ","بر اساس نفرات","قبوض","دریافت","حق شارژ","هزینه","همه واحدها","فقط مسکونی","پرداخت از شارژ","درآمدها","درآمدهای متفرقه","وجود ندارد","لطفا کد واحد را صحیح وارد کنید","واحد خالی","واحد مسکونی","حق شارژ ماهانه"]
[null,"تاریخ","مبلغ","نوع","دسته","واحد","توضيحات","TY","DS","Total"]
[1,null,null,null,null,null,null,1,1,12485410]
[null,null,null,null,null,null,null,1,1,12485410]
[null,null,null,null,null,null,null,1,1,12485410]
{"$rows_left_out":71}
{"sheet":"Report","index":2,"n_rows":57,"n_cols":16,"rows_kept":57,"cut":false,"hidden":false,"merged":[[6,14,6,15],[3,14,3,15],[4,1,4,2],[4,3,4,4],[4,6,4,7],[4,8,4,9],[4,10,4,11],[4,12,4,15],[3,1,3,5],[3,7,3,8],[3,10,3,11],[3,12,3,13],[5,1,5,2],[5,3,5,8],[5,9,5,11],[5,12,5,15]]}
[]
[]
[]
[null,"گزارش کلی وضعیت حساب واحدهای ساختمان نمونه",null,null,null,null," از تاریخ :","1404/05/01",null,"تا تاریخ :","1404/05/31",null,"تاریخ تنظیم گزارش :",null,{"$f":"J_TODAY(1)","v":"1404/07/09"}]
[null,"برداشت از حساب:",null,{"$f":"SUMIFS(data5[مبلغ],data5[TY],1,data5[تاریخ],\">=\"&H4,data5[تاریخ],\"<=\"&K4)+SUMIFS(data5[مبلغ],data5[TY],2,data5[تاریخ],\">=\"&H4,data5[تاریخ],\"<=\"&K4)+SUMIFS(data5[مبلغ],data5[TY],6,data5[تاریخ],\">=\"&H4,data5[تاریخ],\"<=\"&K4)","v":0},null,"واریز شده :",{"$f":"SUMIFS(data5[مبلغ],data5[TY],3,data5[تاریخ],\">=\"&H4,data5[تاریخ],\"<=\"&K4)+SUMIFS(data5[مبلغ],data5[TY],5,data5[تاریخ],\">=\"&H4,data5[تاریخ],\"<=\"&K4)","v":0},null,"موجودی فعلی حساب :",null,{"$f":"Sett!N17+SUMIFS(data5[مبلغ],data5[TY],3)+SUMIFS(data5[مبلغ],data5[TY],5)-SUMIFS(data5[مبلغ],data5[TY],1)-SUMIFS(data5[مبلغ],data5[TY],2)-SUMIFS(data5[مبلغ],data5[TY],6)","v":0},null,"توضیحات : ندارد"]
[null,"اطلاعات واحد",null,"موارد بدهکار شده",null,null,null,null,null,"موارد بستانکار شده",null,null,"وضعیت مانده حساب"]
[null,"كد","عنوان / مالك فعلی","حق شارژ",{"$f":"[2]Sett!O5","v":"آب مشاع"},{"$f":"[2]Sett!O6","v":"گاز مشاع"},{"$f":"[2]Sett!O7","v":"برق مشاع"},{"$f":"[2]Sett!O8","v":"سایر قبوض"},"سایر هزینه ها",{"$f":"[2]Sett!O21","v":"حق شارژ"},{"$f":"[2]Sett!O22","v":"سهم قبوض"},{"$f":"[2]Sett!O23","v":"سایر موارد"},"کل بدهکاری","کل بستانکاری","مانده حساب واحد"]
[null,1,{"$f":"IFERROR(VLOOKUP(B8,sett[#Data],2,FALSE)&\" / \"&VLOOKUP(B8,sett[#Data],6,FALSE),\"\")","v":"واحد 1 / "},{"$f":"IF(C8<>\"\",SUMIFS(data5[مبلغ],data5[TY],4,data5[واحد],B8,data5[تاریخ],\">=\"&H$4,data5[تاریخ],\"<=\"&K$4),\"\")","v":0},{"$f":"IF(C8<>\"\",SUMIFS(data5[مبلغ],data5[TY],1,data5[DS],1,data5[واحد],B8,data5[تاریخ],\">=\"&H$4,data5[تاریخ],\"<=\"&K$4),\"\")","v":0},{"$f":"IF(D8<>\"\",SUMIFS(data5[نوع],data5[DS],1,data5[Total],1,data5[توضيحات],C8,data5[مبلغ],\">=\"&I$4,data5[مبلغ],\"<=\"&L$4),\"\")","v":0},{"$f":"IF(E8<>\"\",SUMIFS(data5[دسته],data5[Total],1,data5[تاریخ],1,data5[TY],D8,data5[نوع],\">=\"&J$4,data5[نوع],\"<=\"&M$4),\"\")","v":0},{"$f":"IF(F8<>\"\",SUMIFS(data5[واحد],data5[تاریخ],1,data5[مبلغ],1,data5[DS],E8,data5[دسته],\">=\"&K$4,data5[دسته],\"<=\"&N$4),\"\")","v":0},{"$f":"IF(G8<>\"\",SUMIFS(data5[توضيحات],data5[مبلغ],1,data5[نوع],1,data5[Total],F8,data5[واحد],\">=\"&L$4,data5[واحد],\"<=\"&O$4),\"\")","v":0},{"$f":"IF(C8<>\"\",SUMIFS(data5[مبلغ],data5[TY],3,data5[DS],1,data5[واحد],B8,data5[تاریخ],\">=\"&H$4,data5[تاریخ],\"<=\"&K$4),\"\")","v":0},{"$f":"IF(C8<>\"\",SUMIFS(data5[مبلغ],data5[TY],3,data5[DS],2,data5[واحد],B8,data5[تاریخ],\">=\"&H$4,data5[تاریخ],\"<=\"&K$4),\"\")","v":0},{"$f":"IF(C8<>\"\",SUMIFS(data5[مبلغ],data5[TY],3,data5[DS],3,data5[واحد],B8,data5[تاریخ],\">=\"&H$4,data5[تاریخ],\"<=\"&K$4),\"\")","v":0},{"$f":"IF(C8<>\"\",SUM(D8:I8),\"\")","v":0},{"$f":"IF(C8<>\"\",SUM(J8:L8),\"\")","v":0},{"$f":"IF(C8<>\"\",M8-N8+Sett!K5,\"\")","v":0},{"$f":"IF(C8<>\"\",IF(O8=0,\"صفر\",IF(O8>0,\"بدهکار\",\"بستانکار\")),\"\")","v":"صفر"}]
[null,2,{"$f":"IFERROR(VLOOKUP(B9,sett[#Data],2,FALSE)&\" / \"&VLOOKUP(B9,sett[#Data],6,FALSE),\"\")","v":"واحد 2 / "},{"$f":"IF(C9<>\"\",SUMIFS(data5[مبلغ],data5[TY],4,data5[واحد],B9,data5[تاریخ],\">=\"&H$4,data5[تاریخ],\"<=\"&K$4),\"\")","v":0},{"$f":"IF(C9<>\"\",SUMIFS(data5[مبلغ],data5[TY],1,data5[DS],1,data5[واحد],B9,data5[تاریخ],\">=\"&H$4,data5[تاریخ],\"<=\"&K$4),\"\")","v":0},{"$f":"IF(D9<>\"\",SUMIFS(data5[نوع],data5[DS],1,data5[Total],1,data5[توضيحات],C9,data5[مبلغ],\">=\"&I$4,data5[مبلغ],\"<=\"&L$4),\"\")","v":0},{"$f":"IF(E9<>\"\",SUMIFS(data5[دسته],data5[Total],1,data5[تاریخ],1,data5[TY],D9,data5[نوع],\">=\"&J$4,data5[نوع],\"<=\"&M$4),\"\")","v":0},{"$f":"IF(F9<>\"\",SUMIFS(data5[واحد],data5[تاریخ],1,data5[مبلغ],1,data5[DS],E9,data5[دسته],\">=\"&K$4,data5[دسته],\"<=\"&N$4),\"\")","v":0},{"$f":"IF(G9<>\"\",SUMIFS(data5[توضيحات],data5[مبلغ],1,data5[نوع],1,data5[Total],F9,data5[واحد],\">=\"&L$4,data5[واحد],\"<=\"&O$4),\"\")","v":0},{"$f":"IF(C9<>\"\",SUMIFS(data5[مبلغ],data5[TY],3,data5[DS],1,data5[واحد],B9,data5[تاریخ],\">=\"&H$4,data5[تاریخ],\"<=\"&K$4),\"\")","v":0},{"$f":"IF(C9<>\"\",SUMIFS(data5[مبلغ],data5[TY],3,data5[DS],2,data5[واحد],B9,data5[تاریخ],\">=\"&H$4,data5[تاریخ],\"<=\"&K$4),\"\")","v":0},{"$f":"IF(C9<>\"\",SUMIFS(data5[مبلغ],data5[TY],3,data5[DS],3,data5[واحد],B9,data5[تاریخ],\">=\"&H$4,data5[تاریخ],\"<=\"&K$4),\"\")","v":0},{"$f":"IF(C9<>\"\",SUM(D9:I9),\"\")","v":0},{"$f":"IF(C9<>\"\",SUM(J9:L9),\"\")","v":0},{"$f":"IF(C9<>\"\",M9-N9+Sett!K6,\"\")","v":0},{"$f":"IF(C9<>\"\",IF(O9=0,\"صفر\",IF(O9>0,\"بدهکار\",\"بستانکار\")),\"\")","v":"صفر"}]
[null,3,{"$f":"IFERROR(VLOOKUP(B10,sett[#Data],2,FALSE)&\" / \"&VLOOKUP(B10,sett[#Data],6,FALSE),\"\")","v":"واحد 3 / "},{"$f":"IF(C10<>\"\",SUMIFS(data5[مبلغ],data5[TY],4,data5[واحد],B10,data5[تاریخ],\">=\"&H$4,data5[تاریخ],\"<=\"&K$4),\"\")","v":0},{"$f":"IF(C10<>\"\",SUMIFS(data5[مبلغ],data5[TY],1,data5[DS],1,data5[واحد],B10,data5[تاریخ],\">=\"&H$4,data5[تاریخ],\"<=\"&K$4),\"\")","v":0},{"$f":"IF(D10<>\"\",SUMIFS(data5[نوع],data5[DS],1,data5[Total],1,data5[توضيحات],C10,data5[مبلغ],\">=\"&I$4,data5[مبلغ],\"<=\"&L$4),\"\")","v":0},{"$f":"IF(E10<>\"\",SUMIFS(data5[دسته],data5[Total],1,data5[تاریخ],1,data5[TY],D10,data5[نوع],\">=\"&J$4,data5[نوع],\"<=\"&M$4),\"\")","v":0},{"$f":"IF(F10<>\"\",SUMIFS(data5[واحد],data5[تاریخ],1,data5[مبلغ],1,data5[DS],E10,data5[دسته],\">=\"&K$4,data5[دسته],\"<=\"&N$4),\"\")","v":0},{"$f":"IF(G10<>\"\",SUMIFS(data5[توضيحات],data5[مبلغ],1,data5[نوع],1,data5[Total],F10,data5[واحد],\">=\"&L$4,data5[واحد],\"<=\"&O$4),\"\")","v":0},{"$f":"IF(C10<>\"\",SUMIFS(data5[مبلغ],data5[TY],3,data5[DS],1,data5[واحد],B10,data5[تاریخ],\">=\"&H$4,data5[تاریخ],\"<=\"&K$4),\"\")","v":0},{"$f":"IF(C10<>\"\",SUMIFS(data5[مبلغ],data5[TY],3,data5[DS],2,data5[واحد],B10,data5[تاریخ],\">=\"&H$4,data5[تاریخ],\"<=\"&K$4),\"\")","v":0},{"$f":"IF(C10<>\"\",SUMIFS(data5[مبلغ],data5[TY],3,data5[DS],3,data5[واحد],B10,data5[تاریخ],\">=\"&H$4,data5[تاریخ],\"<=\"&K$4),\"\")","v":0},0,0,{"$f":"IF(C10<>\"\",M10-N10+Sett!K7,\"\")","v":0},"صفر"]
{"$rows_left_out":48}
{"sheet":"Stat","index":3,"n_rows":256,"n_cols":12,"rows_kept":256,"cut":false,"hidden":false,"merged":[[1,1,1,6],[2,2,2,3],[2,5,2,6],[2,7,2,8],[3,1,4,1],[3,2,4,3],[3,4,4,4],[3,5,4,6],[3,7,4,7],[3,8,4,8]]}
[]
[null,"گزارش صورت حساب واحدها - ساختمان نمونه",null,null,null,null,null,1,{"$f":"IF(H2>0,VLOOKUP(H2,sett[],2,FALSE)&\" - مالک : \"&VLOOKUP(H2,sett[],6,FALSE),0)","v":"واحد 1 - مالک : "}]
[null,"از تاریخ :","1404/01/01",null,"تا تاریخ :","1404/12/29",null,"توضیح : "]
[null,"بدهکار شده :",{"$f":"SUMIFS(D7:D256,E7:E256,L$5)","v":0},null,"بستانکار شده :",{"$f":"SUMIFS(D7:D256,E7:E256,L$6)","v":0},null,"مانده :",{"$f":"C4-F4","v":0}]
[null,null,null,null,null,null,null,null,null,null,null,"بدهکار"]
[{"$f":"256-COUNTIF(B7:B256,\"\")","v":8},"تاریخ","مبلغ کل","سهم واحد","ماهیت","نوع","دسته","واحد","توضیحات",null,null,"بستانکار"]
[1,{"$f":"IFERROR(VLOOKUP(A7,Data!A$8:J$30,2,FALSE),\"\")","v":0},{"$f":"IFERROR(VLOOKUP(A7,Data!A$8:J$30,10,FALSE),\"\")","v":12485410},{"$f":"IFERROR(VLOOKUP(A7,Data!A$8:J$30,3,FALSE),\"\")","v":0},{"$f":"IF(L7>0,IF(L7=3,L$6,L$5),\"\")","v":"بدهکار"},{"$f":"IFERROR(VLOOKUP(A7,Data!A$8:J$30,4,FALSE),\"\")","v":0},{"$f":"IFERROR(VLOOKUP(A7,Data!A$8:J$30,5,FALSE),\"\")","v":0},{"$f":"IFERROR(VLOOKUP(A7,Data!A$8:J$30,6,FALSE),\"\")","v":0},{"$f":"IFERROR(VLOOKUP(A7,Data!A$8:J$30,7,FALSE),\"\")","v":0},null,null,{"$f":"IFERROR(VLOOKUP(A7,Data!A$8:J$30,8,FALSE),0)","v":1}]
[2,{"$f":"IFERROR(VLOOKUP(A8,Data!A$8:J$30,2,FALSE),\"\")","v":0},{"$f":"IFERROR(VLOOKUP(A8,Data!A$8:J$30,10,FALSE),\"\")","v":3000000},{"$f":"IFERROR(VLOOKUP(A8,Data!A$8:J$30,3,FALSE),\"\")","v":0},{"$f":"IF(L8>0,IF(L8=3,L$6,L$5),\"\")","v":"بستانکار"},{"$f":"IFERROR(VLOOKUP(A8,Data!A$8:J$30,4,FALSE),\"\")","v":0},{"$f":"IFERROR(VLOOKUP(A8,Data!A$8:J$30,5,FALSE),\"\")","v":0},{"$f":"IFERROR(VLOOKUP(A8,Data!A$8:J$30,6,FALSE),\"\")","v":0},{"$f":"IFERROR(VLOOKUP(A8,Data!A$8:J$30,7,FALSE),\"\")","v":0},null,null,{"$f":"IFERROR(VLOOKUP(A8,Data!A$8:J$30,8,FALSE),0)","v":3}]
[3,{"$f":"IFERROR(VLOOKUP(A9,Data!A$8:J$30,2,FALSE),\"\")","v":""},{"$f":"IFERROR(VLOOKUP(A9,Data!A$8:J$30,10,FALSE),\"\")","v":""},{"$f":"IFERROR(VLOOKUP(A9,Data!A$8:J$30,3,FALSE),\"\")","v":""},"",{"$f":"IFERROR(VLOOKUP(A9,Data!A$8:J$30,4,FALSE),\"\")","v":""},{"$f":"IFERROR(VLOOKUP(A9,Data!A$8:J$30,5,FALSE),\"\")","v":""},{"$f":"IFERROR(VLOOKUP(A9,Data!A$8:J$30,6,FALSE),\"\")","v":""},{"$f":"IFERROR(VLOOKUP(A9,Data!A$8:J$30,7,FALSE),\"\")","v":""},null,null,{"$f":"IFERROR(VLOOKUP(A9,Data!A$8:J$30,8,FALSE),0)","v":0}]
[4,{"$f":"IFERROR(VLOOKUP(A10,Data!A$8:J$30,2,FALSE),\"\")","v":""},{"$f":"IFERROR(VLOOKUP(A10,Data!A$8:J$30,10,FALSE),\"\")","v":""},{"$f":"IFERROR(VLOOKUP(A10,Data!A$8:J$30,3,FALSE),\"\")","v":""},"",{"$f":"IFERROR(VLOOKUP(A10,Data!A$8:J$30,4,FALSE),\"\")","v":""},{"$f":"IFERROR(VLOOKUP(A10,Data!A$8:J$30,5,FALSE),\"\")","v":""},{"$f":"IFERROR(VLOOKUP(A10,Data!A$8:J$30,6,FALSE),\"\")","v":""},{"$f":"IFERROR(VLOOKUP(A10,Data!A$8:J$30,7,FALSE),\"\")","v":""},null,null,{"$f":"IFERROR(VLOOKUP(A10,Data!A$8:J$30,8,FALSE),0)","v":0}]
{"$rows_left_out":247}
{"sheet":"Sett","index":4,"n_rows":54,"n_cols":22,"rows_kept":54,"cut":false,"hidden":false,"merged":[[25,13,25,14],[2,1,2,10],[2,13,2,14],[15,13,15,14],[16,13,16,14],[18,13,18,14]]}
[]
[null,{"$f":"COUNTA(sett[عنوان])","v":20},99,{"$f":"SUM(sett[متراژ])","v":0},null,{"$f":"SUM(sett[نفرات])","v":0},null,null,null,null,null,null,null,null,null,null,null,null,null,{"$f":"COUNTIF(T5:T44,\">0\")","v":0},{"$f":"SUM(U5:U44)","v":0},{"$f":"SUM(V5:V44)","v":0}]
[null,"تعريف واحدهاي موجود در ساختمان",null,null,null,null,null,null,null,null,null,null,null,"تعریف انواع هزینه ها"]
[null,"کد","عنوان","متراژ","وضعیت","نفرات","نام مالك فعلی","تلفن واحد","موبایل مالک","توضیحات واحد","مانده حساب",null,null,"كد","نوع قبض"]
[null,1,"واحد 1",null,null,null,null,null,null,null,0,null,null,1,"آب مشاع",null,null,1,{"$f":"COUNTIF(E$4:E5,2)","v":0},{"$f":"SUMIFS(B$5:B$71,E$5:E$71,2,S$5:S$46,R5)","v":{"$error":"#VALUE!"}},{"$f":"IFERROR(VLOOKUP(T5,sett[],3,FALSE),0)","v":0},{"$f":"IFERROR(VLOOKUP(T5,sett[],5,FALSE),0)","v":0}]
[null,2,"واحد 2",null,null,null,null,null,null,null,null,null,null,2,"گاز مشاع",null,null,2,{"$f":"COUNTIF(E$4:E6,2)","v":0},{"$error":"#VALUE!"},{"$f":"IFERROR(VLOOKUP(T6,sett[],3,FALSE),0)","v":0},{"$f":"IFERROR(VLOOKUP(T6,sett[],5,FALSE),0)","v":0}]
[null,3,"واحد 3",null,null,null,null,null,null,null,null,null,null,3,"برق مشاع",null,null,3,{"$f":"COUNTIF(E$4:E7,2)","v":0},{"$error":"#VALUE!"},{"$f":"IFERROR(VLOOKUP(T7,sett[],3,FALSE),0)","v":0},{"$f":"IFERROR(VLOOKUP(T7,sett[],5,FALSE),0)","v":0}]
[null,4,"واحد 4",null,null,null,null,null,null,null,null,null,null,4,"سایر قبوض",null,null,4,{"$f":"COUNTIF(E$4:E8,2)","v":0},{"$error":"#VALUE!"},{"$f":"IFERROR(VLOOKUP(T8,sett[],3,FALSE),0)","v":0},{"$f":"IFERROR(VLOOKUP(T8,sett[],5,FALSE),0)","v":0}]
[null,5,"واحد 5",null,null,null,null,null,null,null,null,null,null,"کد","نوع هزینه",null,null,5,{"$f":"COUNTIF(E$4:E9,2)","v":0},{"$error":"#VALUE!"},{"$f":"IFERROR(VLOOKUP(T9,sett[],3,FALSE),0)","v":0},{"$f":"IFERROR(VLOOKUP(T9,sett[],5,FALSE),0)","v":0}]
[null,6,"واحد 6",null,null,null,null,null,null,null,null,null,null,1,"تاسيسات ساختمان",null,null,6,{"$f":"COUNTIF(E$4:E10,2)","v":0},{"$error":"#VALUE!"},{"$f":"IFERROR(VLOOKUP(T10,sett[],3,FALSE),0)","v":0},{"$f":"IFERROR(VLOOKUP(T10,sett[],5,FALSE),0)","v":0}]
{"$rows_left_out":45}
{"sheet":"Archive","index":5,"n_rows":4,"n_cols":8,"rows_kept":4,"cut":false,"hidden":false,"merged":[[1,1,1,7]]}
[]
[null,"ثبت تغییرات مالکین و ساکنین واحدهای ساختمان"]
[null,"واحد","خرید / اجاره","نام مالک / مستاجر جدید","شماره تماس","تاریخ ورود","تاریخ خروج","توضیحات اضافه"]
[null,null,null,null,null,null,null,"توضیحات مد نظرتان را وارد کنید"]